{"text_format":"1","workbook":"xlsx","n_sheets":16,"sheets":["Main","Instructions","Model Applicability","ASK14","ASK14_Coeffs","BSSA14","BSSA14_Coeffs","CB14","CB14_Coeffs","CY14","CY14_Coeffs","I14","I14_Coeffs","GMPEs Comparison","DSF","Sheet1"],"not_rendered":{"charts":9,"images":11,"macros":1,"external_links":0,"defined_names":0,"comments":1,"pivot_tables":0},"unopened":[],"bounds":{"document_bytes":16777216,"sheet_cells":100000,"rows_first":2000,"rows_last":500,"rows_between":2000,"halvings":0,"cell_chars":16384,"cell_head_chars":4096},"cells_cut":0,"cells_raw":0,"read":"whole","date_system":"1900"}

{"sheet":"Main","index":0,"n_rows":118,"n_cols":29,"rows_kept":118,"cut":false,"hidden":false,"merged":[[117,1,124,21],[1,1,1,6],[1,8,1,21],[22,3,42,3],[19,3,19,21],[2,1,2,21],[3,1,3,21],[14,9,14,14],[15,9,15,14],[5,1,5,21],[6,1,6,21],[7,1,7,21],[11,9,11,14],[79,1,79,2],[20,5,20,8],[12,9,12,14],[106,3,106,7],[105,1,105,3],[15,4,15,7],[13,9,13,14],[20,9,20,12]]}
[]
[null,null,null,null,null,null,null," "]
[null,"PACIFIC EARTHQUAKE ENGINEERING RESEARCH CENTER"]
[null," "]
[]
[null,"WEIGHTED AVERAGE of 2014 NGA WEST-2 GMPEs"]
{"$rows_left_out":113}
{"sheet":"Instructions","index":1,"n_rows":34,"n_cols":8,"rows_kept":34,"cut":false,"hidden":false,"merged":[[11,1,11,7]]}
["Region codes","ASK14","BSSA14","CB14","CY14","I14"]
["Global"]
["California","Base","Base","Base","Base"]
["China","Linear R term, no Vs30 scaling","Anelastic Attenuation ","Anelastic Attenuation ","Anelastic Attenuation "]
["Italy",null,"Anelastic Attenuation ","Anelastic Attenuation "," Sigma"]
["Japan","Linear R term, Vs30 scaling","Anelas. attenuation, basin depth","Anelas. Attenuation, shallow site effects, and basin effects ","Basin depth, sigma"]
{"$rows_left_out":29}
{"sheet":"Model Applicability","index":2,"n_rows":30,"n_cols":4,"rows_kept":30,"cut":false,"hidden":false,"merged":[[27,1,29,1],[0,1,0,3],[2,1,4,1],[5,1,10,1],[11,1,19,1],[20,1,26,1]]}
[null,"Model Limits for Horizontal GMPEs"]
[null,"GMPE","Parameter","MODEL RANGEs"]
[null,"ASK14","Mw  (All FM)",">= 3.0 - <=8.5"]
[null,null,"R",">= 0 - <= 300"]
[null,null,"VS30",">= 180, <= 1000"]
[null,"BSSA14","Mw  (SS)",">= 3.0 - <=8.5"]
{"$rows_left_out":25}
{"sheet":"ASK14","index":3,"n_rows":59,"n_cols":6,"rows_kept":59,"cut":false,"hidden":false,"merged":[[5,2,25,2],[3,4,3,5]]}
["ABRAHAMSON - SILVA - KAMAI NGA-WEST2 MODEL COEFFICIENTS [ASK14] (EQS 2014) & Dec13 Revisions (Kamai, pers. comm.):"]
[]
["Input variables","Errors and warnings",null,null,"ASK_14 (M, Rrup, Rjb, Rx, Frv, Fnm, Fhw, FAS, Ztor, W, dip, Vs30, Z1, Ry0, Region, T)"]
[null,null,null,null,"Visual Basic Calculations"]
["M",null,"GMP","T (s)","Median","s"]
[{"$f":"Main!$B$24","v":6.8},{"$f":"IF(OR($A$6<3,$A$6>8.5),\"! Not Applicable !\",\"\")","v":""},"PSa (g)",0.01,{"$f":"ASK_14($A$6,$A$9,$A$12,$A$15,$A$24,$A$27,$A$30,$A$51,$A$36,$A$45,$A$33,$A$21,$A$48, $A$42,$A$18,$A$54,$D6)","v":0.41109604774387049},{"$f":"ASK14_stdev($A$6,$A$9,$A$12,$A$15,$A$24,$A$27,$A$30,$A$51,$A$36,$A$45,$A$33,$A$21,$A$48,$A$42,$A$18,$A$54,D6)","v":0.63878087009552809}]
{"$rows_left_out":54}
{"sheet":"ASK14_Coeffs","index":4,"n_rows":28,"n_cols":46,"rows_kept":28,"cut":false,"hidden":false,"merged":[]}
["ABRAHAMSON - SILVA - KAMAI NGA-WEST2 MODEL COEFFICIENTS [ASK14] (EQS 2014) & Dec13 Revisions (Kamai, pers. comm.):"]
[]
["Period","VLIN","b","n","M1","c","c4","a1","a2","a3","a4","a5","a6","a7","a8","a10","a11","a12","a13","a14","a15","a16","a17","a43","a44","a45","a46","a25","a28","a29","a31","a36","a37","a38","a39","a40","a41","a42","s1","s2","s3","s4","s1 (known vs)","s2 (known vs)","s5 (Japan Phi)","s6 (Japan Phi)"]
[]
[0.01,660,-1.47,1.5,6.75,2.4,4.5,0.58699999999999997,-0.79,0.27500000000000002,-0.1,-0.41,2.1541000000000001,0,-1.4999999999999999E-2,1.7350000000000001,0,-0.1,0.6,-0.3,1.1000000000000001,0,-7.1999999999999998E-3,0.1,0.05,0,-0.05,-1.5E-3,2.5000000000000001E-3,-3.3999999999999998E-3,-0.15029999999999999,0.26500000000000001,0.33700000000000002,0.188,0,8.7999999999999995E-2,-0.19600000000000001,4.3999999999999997E-2,0.754,0.52,0.47,0.36,0.74099999999999999,0.501,0.54,0.63]
[0.02,680,-1.4590000000000001,1.5,6.75,2.4,4.5,0.59799999999999998,-0.79,0.27500000000000002,-0.1,-0.41,2.1461000000000001,0,-1.4999999999999999E-2,1.718,0,-0.1,0.6,-0.3,1.1000000000000001,0,-7.3000000000000001E-3,0.1,0.05,0,-0.05,-1.5E-3,2.3999999999999998E-3,-3.3E-3,-0.1479,0.255,0.32800000000000001,0.184,0,8.7999999999999995E-2,-0.19400000000000001,6.0999999999999999E-2,0.76,0.52,0.47,0.36,0.747,0.501,0.54,0.63]
{"$rows_left_out":23}
{"sheet":"BSSA14","index":5,"n_rows":101,"n_cols":20,"rows_kept":101,"cut":false,"hidden":false,"merged":[[5,2,25,2],[2,2,2,17],[3,18,3,19]]}
["BOORE - STEWART - SEYHAN - ATKINSON - NGA-WEST2 MODEL COEFFICIENTS [BSSA14] (EQS 2013) & sigma updates:"]
[]
["Input variables","Errors and warnings",null,null,null,null,null,null,null,null,null,null,null,null,null,null,null,null,"BSSA_14 (M, Rjb, U, RS, NS, Vs30, Region, Z1, PGAr, T)"]
[null,null,null,null,null,null,null,null,null,null,null,null,null,null,null,null,null,null,"Visual Basic Calculations"]
["M",null,"GMP","T (s)","fmag","fdis","flin","fnl","dz1","fz1","fsite","Median","t(M)","f(M)","f(M,R)","f(M,RJB,VS30)","s (M)","s","Median","s"]
[{"$f":"Main!$B$24","v":6.8},{"$f":"IF(AND($A$21=1,$A$6<3),\"! Not Applicable !\",IF(AND($A$21=1,$A$6>8.5),\"! Not Applicable !\",IF(AND($A$33=1,$A$6<3),\"! Not Applicable !\",IF(AND($A$33=1,$A$6>8.5),\"! Not Applicable !\",IF(AND($A$24=1,$A$6<3),\"! Not Applicable !\",IF(AND($A$24=1,$A$6>7),\"! Not Applicable !\",\"\"))))))","v":""},"PSa (g)",0.01,{"$f":"IF($A$6<=BSSA14_Coeffs!$I5,(BSSA14_Coeffs!$B5*$A$18+BSSA14_Coeffs!$C5*$A$33+BSSA14_Coeffs!$D5*$A$24+BSSA14_Coeffs!$E5*$A$21+BSSA14_Coeffs!$F5*($A$6-BSSA14_Coeffs!$I5)+BSSA14_Coeffs!$G5*($A$6-BSSA14_Coeffs!I5)^2),(BSSA14_Coeffs!$B5*$A$18+BSSA14_Coeffs!$C5*$A$33+BSSA14_Coeffs!$D5*$A$24+BSSA14_Coeffs!$E5*$A$21+BSSA14_Coeffs!$H5*($A$6-BSSA14_Coeffs!$I5)))","v":2.4222507999999996},{"$f":"IF($A$30=0,((BSSA14_Coeffs!$J5+BSSA14_Coeffs!$K5*($A$6-BSSA14_Coeffs!$M5))*LN(SQRT(BSSA14!$A$12^2+(BSSA14_Coeffs!$O5^2))/BSSA14_Coeffs!$N5)+(BSSA14_Coeffs!$L5+BSSA14_Coeffs!$P5)*(SQRT(BSSA14!$A$12^2+(BSSA14_Coeffs!$O5^2))-BSSA14_Coeffs!$N5)),IF($A$30=1,((BSSA14_Coeffs!$J5+BSSA14_Coeffs!$K5*($A$6-BSSA14_Coeffs!$M5))*LN(SQRT(BSSA14!$A$12^2+(BSSA14_Coeffs!$O5^2))/BSSA14_Coeffs!$N5)+(BSSA14_Coeffs!$L5+BSSA14_Coeffs!$Q5)*(SQRT(BSSA14!$A$12^2+(BSSA14_Coeffs!$O5^2))-BSSA14_Coeffs!$N5)),IF($A$30=3,((BSSA14_Coeffs!$J5+BSSA14_Coeffs!$K5*($A$6-BSSA14_Coeffs!$M5))*LN(SQRT(BSSA14!$A$12^2+(BSSA14_Coeffs!$O5^2))/BSSA14_Coeffs!$N5)+(BSSA14_Coeffs!$L5+BSSA14_Coeffs!$R5)*(SQRT(BSSA14!$A$12^2+(BSSA14_Coeffs!$O5^2))-BSSA14_Coeffs!$N5)), ((BSSA14_Coeffs!$J5+BSSA14_Coeffs!$K5*($A$6-BSSA14_Coeffs!$M5))*LN(SQRT(BSSA14!$A$12^2+(BSSA14_Coeffs!$O5^2))/BSSA14_Coeffs!$N5)+(BSSA14_Coeffs!$L5+BSSA14_Coeffs!$P5)*(SQRT(BSSA14!$A$12^2+(BSSA14_Coeffs!$O5^2))-BSSA14_Coeffs!$N5)))))","v":-1.088712519134404},{"$f":"IF($A$15<= BSSA14_Coeffs!$T5, BSSA14_Coeffs!$S5 * LN(BSSA14!$A$15/ 760),  BSSA14_Coeffs!$S5* LN(BSSA14_Coeffs!$T5/ 760))","v":0},{"$f":"BSSA14_Coeffs!$V5 + (BSSA14_Coeffs!$X5 * ((EXP(BSSA14_Coeffs!$Y5* (MIN($A$15,760) - 360))) - EXP(BSSA14_Coeffs!$Y5* (760 - 360)))) * LN((BSSA14!$A$38 + BSSA14_Coeffs!$W5) / BSSA14_Coeffs!$W5)","v":0},{"$f":"IF($A$27=999,0,$A$27-(IF($A$30 = 0, (EXP(-7.15 / 4 * LN(($A$15 ^ 4 + 570.94 ^ 4) / (1360 ^ 4 + 570.94 ^ 4))) / 1000), IF($A$30 = 2, (EXP(-5.23 / 2 * LN(($A$15 ^ 2 + 412.39 ^ 2) / (1360 ^ 2 + 412.39 ^ 2))) / 1000), (EXP(-7.15 / 4 * LN(($A$15 ^ 4 + 570.94 ^ 4) / (1360 ^ 4 + 570.94 ^ 4))) / 1000)))))","v":6.6867939150881961E-3},{"$f":"IF($D6 < 0.65, 0, IF(AND($D6 >= 0.65,$I6 <= (BSSA14_Coeffs!$AA5/ BSSA14_Coeffs!$Z5)), BSSA14_Coeffs!$Z5* BSSA14!$I6, IF(AND($D6>= 0.65,$I6 > (BSSA14_Coeffs!$AA5 /BSSA14_Coeffs!$Z5)), BSSA14_Coeffs!$AA5)))","v":0},{"$f":"SUM(G6:H6,J6)","v":0},{"$f":"EXP(SUM($E6,$F6,$K6,I6))","v":3.8199031724867925},{"$f":"IF($A$6<=4.5,BSSA14_Coeffs!$AJ5,IF(AND($A$6>4.5,$A$6<5.5),BSSA14_Coeffs!$AJ5+(BSSA14_Coeffs!$AK5-BSSA14_Coeffs!$AJ5)*(BSSA14!$A$6-4.5),BSSA14_Coeffs!$AK5))","v":0.34499999999999997},{"$f":"IF($A$6<=4.5,BSSA14_Coeffs!$AH5,IF(AND($A$6>4.5,$A$6<5.5),BSSA14_Coeffs!$AH5+(BSSA14_Coeffs!$AI5-BSSA14_Coeffs!$AH5)*(BSSA14!$A$6-4.5),BSSA14_Coeffs!$AI5))","v":0.499},{"$f":"IF($A$12<=BSSA14_Coeffs!$AB5,BSSA14!$N6,IF(AND($A$12>BSSA14_Coeffs!$AB5,$A$12<=BSSA14_Coeffs!$AC5),$N6+BSSA14_Coeffs!$AD5*(LN($A$12/BSSA14_Coeffs!$AB5)/(LN(BSSA14_Coeffs!$AC5/BSSA14_Coeffs!$AB5))),$N6+BSSA14_Coeffs!$AD5))","v":0.499},{"$f":"IF($A$15>=BSSA14_Coeffs!$AG5,$O6,IF(AND($A$15>=BSSA14_Coeffs!$AF5,$A$15<=BSSA14_Coeffs!$AG5),$O6-BSSA14_Coeffs!$AE5*(LN(BSSA14_Coeffs!$AG5/$A$15)/LN(BSSA14_Coeffs!$AG5/BSSA14_Coeffs!$AF5)),$O6-BSSA14_Coeffs!$AE5))","v":0.499},{"$f":"SQRT($M6^2+$N6^2)","v":0.60665146501100609},{"$f":"SQRT($M6^2+$P6^2)","v":0.60665146501100609},{"$f":"BSSA_14($A$6,$A$12,$A$18,$A$21,$A$24,$A$15,$A$30,$A$27,$A$38,$D6)","v":0.44362196068277715},{"$f":"BSSA14_stdev($A$6,$A$12,$A$15,D6)","v":0.60665146501100609}]
{"$rows_left_out":96}
{"sheet":"BSSA14_Coeffs","index":6,"n_rows":27,"n_cols":37,"rows_kept":27,"cut":false,"hidden":false,"merged":[[3,0,3,16383]]}
["BOORE - STEWART - SEYHAN - ATKINSON - NGA-WEST2 MODEL COEFFICIENTS [BSSA14] (EQS 2013) & sigma updates:"]
[]
["T (s)","e0","e1","e2","e3","e4","e5","e6","Mh","c1","c2","c3","Mref","Rref (km)","h (km)","Dc3 (globalCATW)","Dc3 (ChinaTurkey)","Dc3 (ItalyJapan)","c","Vc (m/s)","Vref  (m/s)","f1","f3","f4","f5","f6 (1/km)","f7","R1 (km)","R2 (km)","DfR","DfV","V1 (m/s)","V2 (m/s)","f1","f2","t1","t2"]
[]
[0.01,"0.4534","0.4916","0.2519","0.4599","1.421","0.04932","-0.1659","5.5",-1.1339999999999999,0.19159999999999999,-8.0879999999999997E-3,"4.5","1","4.5",0,2.82E-3,-2.4399999999999999E-3,-0.60370000000000001,1500.2,760,0,0.1,-0.14829999999999999,-7.0099999999999997E-3,-9.9,-9.9,111.67,270,9.6000000000000002E-2,7.0000000000000007E-2,225,300,0.69799999999999995,0.499,0.40200000000000002,0.34499999999999997]
[0.02,"0.48598","0.52359","0.29707","0.48875","1.4331","0.053388","-0.16561","5.5",-1.1394,0.18962000000000001,-8.0739999999999996E-3,"4.5","1","4.5",0,2.7799999999999999E-3,-2.3400000000000001E-3,-0.57389999999999997,1500.36,760,0,0.1,-0.14710000000000001,-7.28E-3,-9.9,-9.9,113.1,270,9.1999999999999998E-2,0.03,225,300,0.70199999999999996,0.502,0.40899999999999997,0.34599999999999997]
{"$rows_left_out":22}
{"sheet":"CB14","index":7,"n_rows":74,"n_cols":26,"rows_kept":74,"cut":false,"hidden":false,"merged":[[5,2,25,2],[3,24,3,25],[3,4,3,15]]}
["CAMPBELL-BOZORGNIA NGA-WEST2 MODEL COEFFICIENTS [CB14] (EQS 2013) & c0 updates:"]
[]
["Input variables","Errors and warnings",null,null,null,null,null,null,null,null,null,null,null,null,null,null,null,null,null,null,null,null,null,null,"CB_14 (M, Rrup, Rjb, Rx, Frv, Fnm, Fhw,Ztor, W, del, Vs30, Z25, Zhyp, Wd, Zhypd, Region, A, T)"]
[null,null,null,null,null,null,null,null,null,null,null,null,null,null,null,null,null,null,null,null,null,null,null,null,"Visual Basic Calculations"]
["M",null,"GMP","T (s)",null,null,null,null,null,null,null,null,null,null,null,null,"a","flnY","f","tlnY","t","fc","s","sArb","Median","s"]
[{"$f":"Main!$B$24","v":6.8},{"$f":"IF(AND($A$6>=3.3, $A$6<=8.5),\"\",\"! Not Applicable !\")","v":""},"PSa (g)",0.01,null,null,null,null,null,null,null,null,null,null,null,null,{"$f":"IF($A$18<CB14_Coeffs!$AG5,CB14_Coeffs!$AH5*$A$56*(($A$56+CB14_Coeffs!$AJ5*($A$18/CB14_Coeffs!$AG5)^CB14_Coeffs!$AK5)^(-1)-($A$56+CB14_Coeffs!$AJ5)^(-1)),0)","v":-2.9360936351976535E-2},{"$f":"IF($A$6<4.5,CB14_Coeffs!$AL5,IF($A$6>5.5,CB14_Coeffs!$AM5,CB14_Coeffs!$AM5+(CB14_Coeffs!$AL5-CB14_Coeffs!$AM5)*(5.5-$A$6)*(5.5-4.5)))","v":0.49199999999999999},{"$f":"SQRT(($R6^2-CB14_Coeffs!$AP5^2)+CB14_Coeffs!$AP5^2+$Q6^2*($R$28^2-CB14_Coeffs!$AP$26^2)+2*$Q6*CB14_Coeffs!$AR5*SQRT($R6^2-CB14_Coeffs!$AP5^2)*SQRT($R$28^2-CB14_Coeffs!$AP$26^2))","v":0.48297578214437015},{"$f":"IF($A$6<4.5,CB14_Coeffs!$AN5,IF($A$6>5.5,CB14_Coeffs!$AO5,CB14_Coeffs!$AO5+(CB14_Coeffs!$AN5-CB14_Coeffs!$AO5)*(5.5-$A$6)*(5.5-4.5)))","v":0.32500000000000001},{"$f":"SQRT($T6^2+$Q6^2*$T$28^2+2*$Q6*CB14_Coeffs!$AR5*$T6*T$28)","v":0.31554577849466359},{"$f":"CB14_Coeffs!AQ5","v":0.16600000000000001},{"$f":"SQRT(S6^2+U6^2)","v":0.57691831697716911},{"$f":"SQRT(V6^2+W6^2)","v":0.60032553207719674},{"$f":"CB_14($A$6,$A$9,$A$12,$A$15,$A$21,$A$24,$A$27,$A$33,$A$42,$A$30,$A$18,$A$39,$A$36,$A$62,$A$71,$A$68,$A$48,$A$56,$D6)","v":0.49843559425426209},{"$f":"W6","v":0.57691831697716911}]
{"$rows_left_out":69}
{"sheet":"CB14_Coeffs","index":8,"n_rows":27,"n_cols":44,"rows_kept":27,"cut":false,"hidden":false,"merged":[[3,0,3,16383]]}
["CAMPBELL-BOZORGNIA NGA-WEST2 MODEL COEFFICIENTS [CB14] (EQS 2013) & c0-c6 updates:"]
[]
["T (s)","c0","c1","c2","c3","c4","c5","c6","c7","c8","c9","c10","c11","c12","c13","c14","c15","c16","c17","c18","c19","c20","Dc20 (CA)","Dc20 (JP)","Dc20 (CH)","a2","h1","h2","h3","h4","h5","h6","k1","k2","k3","c","n","f1","f2","t1","t2","flnAF","fC","rlnPGA,lnY"]
[]
[0.01,-4.3650000000000002,0.97699999999999998,0.53300000000000003,-1.4850000000000001,-0.499,-2.7730000000000001,0.248,6.7530000000000001,0,-0.214,0.72,1.0940000000000001,2.1909999999999998,1.4159999999999999,-7.0000000000000001E-3,-0.20699999999999999,0.39,9.8100000000000007E-2,3.3399999999999999E-2,7.5500000000000003E-3,-5.4999999999999997E-3,0,-3.5000000000000001E-3,3.5999999999999999E-3,0.16800000000000001,0.24199999999999999,1.4710000000000001,-0.71399999999999997,1,-0.33600000000000002,-0.27,865,-1.1859999999999999,1.839,1.88,1.18,0.73399999999999999,0.49199999999999999,0.40400000000000003,0.32500000000000001,0.3,0.16600000000000001,1]
[0.02,-4.3479999999999999,0.97599999999999998,0.54900000000000004,-1.488,-0.501,-2.7719999999999998,0.247,6.5019999999999998,0,-0.20799999999999999,0.73,1.149,2.1890000000000001,1.4530000000000001,-1.67E-2,-0.19900000000000001,0.38700000000000001,0.1009,3.27E-2,7.5900000000000004E-3,-5.4999999999999997E-3,0,-3.5000000000000001E-3,3.5999999999999999E-3,0.16600000000000001,0.24399999999999999,1.4670000000000001,-0.71099999999999997,1,-0.33900000000000002,-0.26300000000000001,865,-1.2190000000000001,1.84,1.88,1.18,0.73799999999999999,0.496,0.41699999999999998,0.32600000000000001,0.3,0.16600000000000001,0.998]
{"$rows_left_out":22}
{"sheet":"CY14","index":9,"n_rows":59,"n_cols":22,"rows_kept":59,"cut":false,"hidden":false,"merged":[[3,20,3,21],[5,2,25,2],[3,4,3,19]]}
["CHIOU - YOUNGS NGA-WEST2 MODEL COEFFICIENTS [CY14] (DEC 2014, EQS):"]
[]
["Input variables","Errors and warnings",null,null,null,null,null,null,null,null,null,null,null,null,null,null,null,null,null,null,"CY_14 (M, Rrup, Rjb, Rx, Vs30, Frv, Fnm, Fhw, del, Ztor, Region, Z1, DDPP, T)"]
[null,null,null,null,null,null,null,null,null,null,null,null,null,null,null,null,null,null,null,null,"Visual Basic Calculations"]
["M",null,"GMP","T (s)",null,null,null,null,null,null,null,null,null,null,null,null,null,null,null,null,"Median","s"]
[{"$f":"Main!$B$24","v":6.8},{"$f":"IF(AND($A$24=0, $A$21=0,$A$6>=3.5,$A$6<=8.5),\"\",IF(AND($A$21=1,$A$6>=3.5,$A$6<=8),\"\",IF(AND($A$24=1,$A$6>=3.5,$A$6<=8),\"\",\"! Not Applicable !\")))","v":""},"PSa (g)",0.01,null,null,null,null,null,null,null,null,null,null,null,null,null,null,null,null,{"$f":"CY_14($A$6,$A$9,$A$12,$A$15,$A$18,$A$21,$A$24,$A$27,$A$30,$A$33,$A$42,$A$36,$A$59,$A$45,$D6)","v":0.41669518742998501},{"$f":"CY14_stdev($A$6,$A$9,$A$12,$A$15,$A$18,$A$21,$A$24,$A$27,$A$30,$A$33,$A$42,$A$36,$A$45,$A$39,$D6)","v":0.56550549985997789}]
{"$rows_left_out":54}
{"sheet":"CY14_Coeffs","index":10,"n_rows":30,"n_cols":46,"rows_kept":30,"cut":false,"hidden":false,"merged":[]}
["CHIOU - YOUNGS NGA-WEST2 MODEL COEFFICIENTS [CY14] (DEC 2014, EQS):"]
[]
["T (s)","c2","c4","c4a","cRB","c8","c8a","c1","c1a","c1b","c1c","c1d","cn","cM","c3","c5","cHM","c6","c7","c7b","c8b","c9","c9a","c9b","c11","c11b","cg1","cg2","cg3","f1","f2","f3","f4","f5","f6","t1","t2","s1","s2","s3","s2,JP","gJp-It","gWn","f1Jp","f5JP","f6JP"]
[]
[0.01,1.06,-2.1,-0.5,50,0,0.26950000000000002,-1.5065,0.16500000000000001,-0.255,-0.16500000000000001,0.255,16.087499999999999,4.9992999999999999,1.9636,6.4550999999999998,3.0956000000000001,0.49080000000000001,3.5200000000000002E-2,4.6199999999999998E-2,0.48330000000000001,0.92279999999999995,0.1202,6.8606999999999996,0,-0.4536,-7.1459999999999996E-3,-6.7580000000000001E-3,4.2542,-0.52100000000000002,-0.14169999999999999,-7.0099999999999997E-3,0.10215100000000001,0,300,0.4,0.26,0.49120000000000003,0.37619999999999998,0.8,0.45279999999999998,1.5817000000000001,0.75939999999999996,-0.68459999999999999,0.45900000000000002,800]
[0.02,1.06,-2.1,-0.5,50,0,0.26950000000000002,-1.4798,0.16500000000000001,-0.255,-0.16500000000000001,0.255,15.7118,4.9992999999999999,1.9636,6.4550999999999998,3.0962999999999998,0.49249999999999999,3.5200000000000002E-2,4.7199999999999999E-2,1.2143999999999999,0.92959999999999998,0.1217,6.8696999999999999,0,-0.4536,-7.2490000000000002E-3,-6.7580000000000001E-3,4.2385999999999999,-0.50549999999999995,-0.13639999999999999,-7.2789999999999999E-3,0.10836,0,300,0.40260000000000001,0.26369999999999999,0.4904,0.37619999999999998,0.8,0.4551,1.5740000000000001,0.76060000000000005,-0.66810000000000003,0.45800000000000002,800]
{"$rows_left_out":25}
{"sheet":"I14","index":11,"n_rows":52,"n_cols":13,"rows_kept":52,"cut":false,"hidden":false,"merged":[[3,11,3,12],[5,2,25,2]]}
["IDRISS NGA-WEST2 MODEL COEFFICIENTS [I14] (MAY 2013, PEER REPORT 2013/08):"]
[]
["Input variables","Errors and warnings",null,null,null,null,null,null,null,null,null,"I_14 (M, Rrup, F, Vs30, T)"]
[null,null,null,null,null,null,null,null,null,null,null,"Visual Basic Calculations"]
["M",null,"GMP","T (s)",null,null,null,null,null,null,null,"Median","s"]
[{"$f":"Main!B24","v":6.8},{"$f":"IF($A$6<5, \"! Not Applicable !\", \"\")","v":""},"PSa (g)",0.01,null,null,null,null,null,null,null,{"$f":"I_14($A$6,$A$9,$A$15,$A$12,D6)","v":0.47895492259525874},{"$f":"I_14_stdev($A$6,D6)","v":0.6671493704256104}]
{"$rows_left_out":47}
{"sheet":"I14_Coeffs","index":12,"n_rows":26,"n_cols":13,"rows_kept":26,"cut":false,"hidden":false,"merged":[[3,1,3,4],[3,5,3,8]]}
["IDRISS NGA-WEST2 MODEL COEFFICIENTS [I14] (MAY 2013, PEER REPORT 2013/08):"]
[]
["T (s)","a1","a2","b1","b2","a1","a2","b1","b2","a3","x","g","j"]
[null,"M ≤ 6.75, VS30 ≥ 450 m/sec",null,null,null,"M > 6.75, VS30 ≥ 450 m/sec"]
[0.01,7.0887000000000002,0.20580000000000001,2.9935,-0.22869999999999999,9.0137999999999998,-7.9399999999999998E-2,2.9935,-0.22869999999999999,5.8900000000000001E-2,-0.85399999999999998,-2.7000000000000001E-3,0.08]
[0.02,7.1157000000000004,0.20580000000000001,2.9935,-0.22869999999999999,9.0408000000000008,-7.9399999999999998E-2,2.9935,-0.22869999999999999,5.8900000000000001E-2,-0.85399999999999998,-2.7000000000000001E-3,0.08]
{"$rows_left_out":21}
{"sheet":"GMPEs Comparison","index":13,"n_rows":35,"n_cols":8,"rows_kept":35,"cut":false,"hidden":true,"merged":[[11,1,31,1],[10,3,10,7]]}
[]
["Option for Sa value","Arithmetic",{"$f":"IF(B2=\"Arithmetic\",\"Weighted average of the spectral values\",\"Weighted average of the natural logarithm of the spectral values\")","v":"Weighted average of the spectral values"}]
[]
["GMPEs","ASK14","BSSA14","CB14","CY14","I14"]
["Weight",{"$f":"Main!$C$14","v":0.25},{"$f":"Main!$D$14","v":0.25},{"$f":"Main!$E$14","v":0.25},{"$f":"Main!$F$14","v":0.25},{"$f":"Main!$G$14","v":0}]
[]
{"$rows_left_out":30}
{"sheet":"DSF","index":14,"n_rows":42,"n_cols":23,"rows_kept":42,"cut":false,"hidden":false,"merged":[[0,0,2,0]]}
[null," By: Sanaz Rezaeian (sanazr128@yahoo.com)"]
[null," I.M. Idriss, Yousef Bozorgnia, Ken Campbell, Norm Abrahamson, Walt Silva"]
[]
["Damping Scaling Factor (DSF) calculation:"]
[]
["Definition:"]
{"$rows_left_out":37}
{"sheet":"Sheet1","index":15,"n_rows":22,"n_cols":14,"rows_kept":22,"cut":false,"hidden":true,"merged":[]}
["T",0.5,1,2,3,5,7,10,15,20,25,30]
[0.01,0.01,0,0,0,"‐",0.02,0.02,0.01,"‐0.01","‐0.02","‐0.03",null,{"$f":"SQRT(x^2+DSF!$W22^2+2*x*DSF!$W22*Sheet1!B2)","v":{"$error":"#NAME?"}}]
[0.02,0.01,0.03,0.04,0.06,"‐","‐0.06","‐0.06","‐0.07","‐0.08","‐0.09","‐0.09"]
[0.03,0.12,0.12,0.12,0.13,"‐","‐0.14","‐0.15","‐0.17","‐0.17","‐0.17","‐0.17"]
[0.05,0.15,0.17,0.17,0.18,"‐","‐0.21","‐0.21","‐0.22","‐0.22","‐0.22","‐0.22"]
[7.4999999999999997E-2,0.1,0.12,0.15,0.15,"‐","‐0.16","‐0.18","‐0.19","‐0.20","‐0.20","‐0.20"]
{"$rows_left_out":16}